{"text_format":"3","workbook":"xlsx","n_sheets":13,"sheets":["メニュー","領収証入力シート","領収証履歴データベース前","領収証履歴データベース","領収証印刷データ","領収証シート1面","領収証印刷シート1面","領収証シート3面","領収証印刷シート3面","読み取りシート","回数","割り算の商と余り","データリスト確認rk2017"],"not_rendered":{"images":4,"macros":1,"defined_names":6,"comments":3},"read":"whole","date_system":"1900"}

{"sheet":"メニュー","index":0,"n_rows":99,"n_cols":13,"rows_kept":99,"merged":[[0,0,0,3],[1,0,1,3],[5,4,5,7],[5,9,5,11],[5,12,5,18],[7,5,7,7],[7,9,7,11],[7,12,7,18],[8,12,8,17],[10,5,10,7],[10,9,10,11],[10,12,10,18],[11,12,11,18],[13,5,13,7],[13,9,13,11],[13,12,13,18],[14,12,14,18],[16,5,16,7],[16,9,16,11],[16,12,16,18],[17,12,17,18],[19,5,19,7],[19,9,19,11],[19,12,19,18],[20,12,20,18],[22,5,22,7],[22,9,22,11],[22,12,22,18]]}
["ソフト種類",{"$nulls":3},"：","領収証作成ソフト",{"$nulls":4},"企画/制作","高金印刷株式会社　　コウキンインサツ （ カ"]
["ソフト名",{"$nulls":3},"：","簡単君rk2017-A4.02",{"$nulls":4},"住所","青森市千刈二丁目1番31号　〒038-0015"]
[{"$nulls":10},"TEL","017-781-2244"]
[{"$nulls":10},"FAX","017-781-2509"]
[]
[{"$nulls":4},"設定手順",{"$nulls":4},"確　認　　/　　入　力",null,null,"内　　　　容"]
[]
[{"$nulls":4},1,"消費税率設定確認",{"$nulls":3},{"v":0.08,"d":"8.00%"},null,null,"消費税の税率を入力します。セルJ8に半角数で数値を入力します（ 例：8.00% ）"]
[{"$nulls":12},"税率を変更する場合、セルＪ8に入力した後に、変更ボタンをクリックします"]
[]
[{"$nulls":4},2,"消費税円未満設定確認",{"$nulls":3},"切り捨てる",null,null,"課税対象額×税率＝円未満の処理方法の選択"]
[{"$nulls":12},"セルJ11をクリックし、現れた▼ボタンを押し、ドロップダウンリストから選択します"]
[]
[{"$nulls":4},3,"印刷パスワード入力",{"$nulls":6},"パスワードを入力していない場合、印刷実行ボタンは機能しません"]
[{"$nulls":12},"専用用紙（パスワード付）を弊社で販売しています"]
[]
[{"$nulls":4},4,"領収証の印刷設定",{"$nulls":6},"印刷設定は領収証印刷シートで設定します　自社名入力・レイアウト等設定できます"]
[{"$nulls":12},"印刷データは、このシートからプリンタに流れてゆきますので、用紙設定は領収証印刷シーでプリンタのプロパティーで設定します"]
[]
[{"$nulls":4},5,"ファイルを開くときの設定確認",{"$nulls":3},"メニュー",null,null,"簡単君ｒｋ2017-Ａ4.xlsmを開くとき、はじめに表示するシートを選択できます"]
[{"$nulls":12},"セルJ20をクリックし、現れた▼ボタンを押し、ドロップダウンリストから選択します"]
[]
[{"$nulls":4},6,"領収証作成",{"$nulls":6},"領収証入力シートで必要事項を入力し領収証を印刷できます"]
{"$rows_empty":57}
[{"$nulls":9},"リスト"]
[{"$nulls":9},"切り捨てる"]
[{"$nulls":9},"切り上げる"]
[{"$nulls":9},"四捨五入"]
[]
[]
[]
[]
[{"$nulls":9},{"$f":"J8","v":{"v":0.08,"d":"8.00%"}}]
[{"$nulls":9},{"$f":"J89*100","v":8}]
[{"$nulls":9},{"$f":"100+J90","v":108}]
[]
[]
[]
[]
[{"$nulls":9},"リスト"]
{"$rows_left_out":4}
{"sheet":"領収証入力シート","index":1,"n_rows":645,"n_cols":49,"rows_kept":645,"merged":[[0,38,0,39],[0,40,0,42],[0,43,0,45],[4,2,4,10],[4,15,7,20],[4,24,6,24],[4,25,6,26],[5,38,19,39],[6,2,8,3],[6,4,8,10],[9,17,12,23],[9,24,12,24],[11,2,12,3],[11,4,12,10],[15,2,17,4],[15,5,17,10],[15,35,19,35],[16,18,25,23],[20,2,21,4],[20,5,21,10],[21,35,30,35],[24,2,26,4],[24,5,26,10],[29,2,31,5],[29,6,31,10],[29,16,31,16],[29,17,31,25],[34,2,35,4],[34,5,35,10],[34,17,35,25],[38,2,39,4],[38,5,39,10],[38,16,39,20],[38,21,39,25],[42,2,43,10],[42,15,43,16],[42,17,43,19],[43,21,46,24],[46,2,46,4],[46,15,48,16],[46,17,48,19],[47,21,51,24],[49,2,54,10],[51,15,52,17],[51,18,52,19],[52,21,56,24],[55,15,57,16],[55,17,57,19],[57,2,62,10],[57,21,61,24],[60,15,62,16],[60,17,62,19]]}
[{"$nulls":38},"漢数字を選択した場合の設定手順",null,"チェックライター風を選択した場合",null,null,"アラビア数字+記号を選択した場合の設定"]
[null,"簡単君rk2017-A4",{"$nulls":13},"↓　顧客名コンボボックス",{"$nulls":7},"↓　日付コンボボックス",{"$nulls":11},"選択（金額表示方法）",null,null,"金額頭文字","金額終わり文字","金額頭文字","カンマ","終止記号","金額頭文字","カンマ","金額終わり文字"]
[{"$nulls":35},"アラビア数字+記号",null,null,"金","也","＠",",","＊","￥",",","-"]
[]
[null,null,"領収証（控）",{"$nulls":12},"領 収 証",{"$nulls":8},"№",{"$nulls":13},"表示する"]
[]
[null,null,"№"]
[]
[]
[{"$nulls":24},"様"]
[]
[null,null,"氏名",null,{"$f":"IF(R10=\"\",\"\",R10)","v":""}]
[]
[]
[]
[null,null,"請求金額",{"$nulls":32},"領収証金額入力欄"]
[{"$nulls":18},{"$f":"IF(AJ22=\"\",\"\",IF(AJ3=\"チェックライター風\",AJ113,IF(AJ3=\"漢数字\",AJ111,IF(AJ3=\"アラビア数字+記号\",AJ118,AJ22))))","v":""}]
[]
[]
[]
[null,null,"領収金額",null,null,{"$f":"IF(AJ22=\"\",\"\",AJ22)","v":""}]
[]
[]
[]
[null,null,"税抜金額",null,null,{"$f":"IF(C25=\"\",\"\",IF(G30=\"\",\"\",IF(AJ22=\"\",\"\",AJ22-G30)))","v":""}]
[]
[]
[]
[]
[null,null,"消費税額等(8%)",{"$nulls":3},{"$f":"IF(OR(C30=AJ99,C30=AJ100,C30=AJ101,C30=AJ102,C30=AJ103,C30=AJ104,C30=AJ105,C30=\"\"),\"\",IF(Y112=0,\"\",IF(Y112=\"\",\"\",Y112)))","v":""},{"$nulls":9},"但"]
[]
[]
[]
[]
[null,null,{"$f":"IF(P56=\"\",\"\",P56)","v":"現　金"},null,null,{"$f":"IF(R56=\"\",\"\",R56)","v":""}]
[]
[]
[]
[null,null,{"$f":"IF(P61=\"\",\"\",P61)","v":"小切手"},null,null,{"$f":"IF(R61=\"\",\"\",R61)","v":""},{"$nulls":15},"上記正に領収いたしました"]
[]
{"$rows_left_out":561}
{"sheet":"領収証履歴データベース前","index":2,"n_rows":11,"n_cols":31,"rows_kept":11,"hidden":true}
{"$rows_empty":9}
[null,"顧客名ID","顧客名","請求金額","領収金額","但書き（上段）","但書き（下段）","領収証発行日付","控項目名1","控項目名1内容","控項目名2","控項目名2内容","控項目名3","控項目名3内容","控項目名4","控項目名4内容","担当者ID","担当者","備考","メモ","領収証印刷日","領収証項目名1","領収証項目名1内容","領収証項目名2","領収証項目名2内容","領収証項目名3","領収証項目名3内容","領収証項目名4","領収証項目名4内容","領収証項目名5","領収証項目名5内容"]
[null,null,{"$f":"IF(領収証入力シート!R10=\"\",\"\",領収証入力シート!R10)","v":""},{"$f":"IF(領収証入力シート!F16=\"\",\"\",領収証入力シート!F16)","v":""},{"$f":"IF(領収証入力シート!S17=\"\",\"\",領収証入力シート!S17)","v":""},{"$f":"IF(領収証入力シート!R30=\"\",\"\",領収証入力シート!R30)","v":""},{"$f":"IF(領収証入力シート!R35=\"\",\"\",領収証入力シート!R35)","v":""},{"$f":"IF(領収証入力シート!Q39=\"\",\"\",領収証入力シート!Q39)","v":""},{"$f":"IF(領収証入力シート!C25=\"\",\"\",領収証入力シート!C25)","v":"税抜金額"},{"$f":"IF(領収証入力シート!F25=\"\",\"\",領収証入力シート!F25)","v":""},{"$f":"IF(領収証入力シート!C30=\"\",\"\",領収証入力シート!C30)","v":"消費税額等(8%)"},{"$f":"IF(領収証入力シート!G30=\"\",\"\",領収証入力シート!G30)","v":""},{"$f":"IF(領収証入力シート!C35=\"\",\"\",領収証入力シート!C35)","v":"現　金"},{"$f":"IF(領収証入力シート!F35=\"\",\"\",領収証入力シート!F35)","v":""},{"$f":"IF(領収証入力シート!C39=\"\",\"\",領収証入力シート!C39)","v":"小切手"},{"$f":"IF(領収証入力シート!F39=\"\",\"\",領収証入力シート!F39)","v":""},{"$nulls":5},{"$f":"IF(領収証入力シート!P43=\"\",\"\",領収証入力シート!P43)","v":"内　訳"},{"$f":"IF(領収証入力シート!R43=\"\",\"\",領収証入力シート!R43)","v":""},{"$f":"IF(領収証入力シート!P47=\"\",\"\",領収証入力シート!P47)","v":"税抜金額"},{"$f":"IF(領収証入力シート!R47=\"\",\"\",領収証入力シート!R47)","v":""},{"$f":"IF(領収証入力シート!P52=\"\",\"\",領収証入力シート!P52)","v":"消費税額等(8%)"},{"$f":"IF(領収証入力シート!S52=\"\",\"\",領収証入力シート!S52)","v":""},{"$f":"IF(領収証入力シート!P56=\"\",\"\",領収証入力シート!P56)","v":"現　金"},{"$f":"IF(領収証入力シート!R56=\"\",\"\",領収証入力シート!R56)","v":""},{"$f":"IF(領収証入力シート!P61=\"\",\"\",領収証入力シート!P61)","v":"小切手"},{"$f":"IF(領収証入力シート!R61=\"\",\"\",領収証入力シート!R61)","v":""}]

{"sheet":"領収証履歴データベース","index":3,"n_rows":10,"n_cols":31,"rows_kept":10,"merged":[[0,1,0,2],[1,1,1,2]]}
[null,"領収証データ転送先頭番号",{"$nulls":24},"E列を基準に、列スクロール量を調整できます"]
[null,"領収証データ転送末尾番号",{"$nulls":24},"№1　の列スクロール量",null,null,8]
[{"$nulls":26},"№2　の列スクロール量",null,null,15]
[{"$nulls":26},"　0 から 21 くらい、の範囲で入力して下さい"]
[]
[]
[]
[]
[]
["領収証ID","顧客名ID","顧客名","請求金額","領収金額","但書き（上段）","但書き（下段）","領収証発行日付","控項目名1","控項目名1内容","控項目名2","控項目名2内容","控項目名3","控項目名3内容","控項目名4","控項目名4内容","担当者ID","担当者","備考","メモ","領収証印刷日","領収証項目名1","領収証項目名1内容","領収証項目名2","領収証項目名2内容","領収証項目名3","領収証項目名3内容","領収証項目名4","領収証項目名4内容","領収証項目名5","領収証項目名5内容"]

{"sheet":"領収証印刷データ","index":4,"n_rows":1010,"n_cols":32,"rows_kept":1010}
["領収証印刷データ"]
{"$rows_empty":8}
["行番号","領収証ID","顧客名ID","顧客名","請求金額","領収金額","但書き（上段）","但書き（下段）","領収証発行日付","控項目名1","控項目名1内容","控項目名2","控項目名2内容","控項目名3","控項目名3内容","控項目名4","控項目名4内容","担当者ID","担当者","備考","メモ","領収証印刷日","領収証項目名1","領収証項目名1内容","領収証項目名2","領収証項目名2内容","領収証項目名3","領収証項目名3内容","領収証項目名4","領収証項目名4内容","領収証項目名5","領収証項目名5内容"]
[1]
[2]
[3]
[4]
[5]
[6]
[7]
[8]
[9]
[10]
[11]
[12]
[13]
[14]
[15]
[16]
[17]
[18]
[19]
[20]
[21]
[22]
[23]
[24]
[25]
[26]
[27]
[28]
[29]
[30]
[31]
[32]
[33]
[34]
[35]
[36]
[37]
{"$rows_left_out":964}
{"sheet":"領収証シート1面","index":5,"n_rows":61,"n_cols":32,"rows_kept":61,"merged":[[1,31,1,34],[4,2,4,10],[4,15,7,20],[4,24,6,24],[4,25,6,26],[4,30,6,30],[4,31,6,34],[6,2,8,3],[6,4,8,10],[9,17,12,23],[9,24,12,24],[11,2,12,3],[11,4,12,10],[15,2,17,4],[15,5,17,10],[16,18,25,23],[20,2,21,4],[20,5,21,10],[24,2,26,4],[24,5,26,10],[29,2,31,5],[29,6,31,10],[29,16,31,16],[29,17,31,25],[34,2,35,4],[34,5,35,10],[34,17,35,25],[38,2,39,4],[38,5,39,10],[38,16,39,20],[38,21,39,25],[42,2,43,10],[42,15,43,16],[42,17,43,19],[43,21,46,24],[46,2,46,4],[46,15,48,16],[46,17,48,19],[47,21,51,24],[49,2,54,10],[51,15,52,17],[51,18,52,19],[52,21,56,24],[55,15,57,16],[55,17,57,19],[57,2,62,10],[57,21,61,24],[60,15,62,16],[60,17,62,19]]}
[]
[null,null,"領収証シート1面",{"$nulls":15},"↓　スクロールバー",{"$nulls":11},{"$f":"COUNTA(領収証印刷データ!B11:B1010)","v":0},"印刷データ　カウント"]
[]
[]
[null,null,"領収証（控）",{"$nulls":12},"領 収 証",{"$nulls":8},"№",{"$f":"IF($AE$5=0,\"\",IF(VLOOKUP($AE$5,領収証印刷データ!$A$11:$AF$1010,2,FALSE)=\"\",\"\",VLOOKUP($AE$5,領収証印刷データ!$A$11:$AF$1010,2,FALSE)))","v":""},{"$nulls":4},0,"行番号"]
[]
[null,null,"№",null,{"$f":"IF($AE$5=0,\"\",IF(VLOOKUP($AE$5,領収証印刷データ!$A$11:$AF$1010,2,FALSE)=\"\",\"\",VLOOKUP($AE$5,領収証印刷データ!$A$11:$AF$1010,2,FALSE)))","v":""}]
[]
[]
[{"$nulls":17},{"$f":"IF($AE$5=0,\"\",IF(VLOOKUP($AE$5,領収証印刷データ!$A$11:$AF$1010,4,FALSE)=\"\",\"\",VLOOKUP($AE$5,領収証印刷データ!$A$11:$AF$1010,4,FALSE)))","v":""},{"$nulls":6},"様"]
[]
[null,null,"氏名",null,{"$f":"IF($AE$5=0,\"\",IF(VLOOKUP($AE$5,領収証印刷データ!$A$11:$AF$1010,4,FALSE)=\"\",\"\",VLOOKUP($AE$5,領収証印刷データ!$A$11:$AF$1010,4,FALSE)))","v":""}]
[]
[]
[]
[null,null,"請求金額",null,null,{"$f":"IF($AE$5=0,\"\",IF(VLOOKUP($AE$5,領収証印刷データ!$A$11:$AF$1010,5,FALSE)=\"\",\"\",VLOOKUP($AE$5,領収証印刷データ!$A$11:$AF$1010,5,FALSE)))","v":""}]
[{"$nulls":18},{"$f":"IF($AE$5=0,\"\",IF(VLOOKUP($AE$5,領収証印刷データ!$A$11:$AF$1010,6,FALSE)=\"\",\"\",VLOOKUP($AE$5,領収証印刷データ!$A$11:$AF$1010,6,FALSE)))","v":""}]
[]
[]
[]
[null,null,"領収金額",null,null,{"$f":"IF($AE$5=0,\"\",IF(VLOOKUP($AE$5,領収証印刷データ!$A$11:$AF$1010,6,FALSE)=\"\",\"\",VLOOKUP($AE$5,領収証印刷データ!$A$11:$AF$1010,6,FALSE)))","v":""}]
[]
[]
[]
[null,null,{"$f":"IF($AE$5=0,\"\",IF(VLOOKUP($AE$5,領収証印刷データ!$A$11:$AF$1010,10,FALSE)=\"\",\"\",VLOOKUP($AE$5,領収証印刷データ!$A$11:$AF$1010,10,FALSE)))","v":""},null,null,{"$f":"IF($AE$5=0,\"\",IF(VLOOKUP($AE$5,領収証印刷データ!$A$11:$AF$1010,11,FALSE)=\"\",\"\",VLOOKUP($AE$5,領収証印刷データ!$A$11:$AF$1010,11,FALSE)))","v":""}]
[]
[]
[]
[]
[null,null,{"$f":"IF($AE$5=0,\"\",IF(VLOOKUP($AE$5,領収証印刷データ!$A$11:$AF$1010,12,FALSE)=\"\",\"\",VLOOKUP($AE$5,領収証印刷データ!$A$11:$AF$1010,12,FALSE)))","v":""},{"$nulls":3},{"$f":"IF($AE$5=0,\"\",IF(VLOOKUP($AE$5,領収証印刷データ!$A$11:$AF$1010,13,FALSE)=\"\",\"\",VLOOKUP($AE$5,領収証印刷データ!$A$11:$AF$1010,13,FALSE)))","v":""},{"$nulls":9},"但",{"$f":"IF($AE$5=0,\"\",IF(VLOOKUP($AE$5,領収証印刷データ!$A$11:$AF$1010,7,FALSE)=\"\",\"\",VLOOKUP($AE$5,領収証印刷データ!$A$11:$AF$1010,7,FALSE)))","v":""}]
[]
[]
[]
[]
[null,null,{"$f":"IF($AE$5=0,\"\",IF(VLOOKUP($AE$5,領収証印刷データ!$A$11:$AF$1010,14,FALSE)=\"\",\"\",VLOOKUP($AE$5,領収証印刷データ!$A$11:$AF$1010,14,FALSE)))","v":""},null,null,{"$f":"IF($AE$5=0,\"\",IF(VLOOKUP($AE$5,領収証印刷データ!$A$11:$AF$1010,15,FALSE)=\"\",\"\",VLOOKUP($AE$5,領収証印刷データ!$A$11:$AF$1010,15,FALSE)))","v":""},{"$nulls":11},{"$f":"IF($AE$5=0,\"\",IF(VLOOKUP($AE$5,領収証印刷データ!$A$11:$AF$1010,8,FALSE)=\"\",\"\",VLOOKUP($AE$5,領収証印刷データ!$A$11:$AF$1010,8,FALSE)))","v":""}]
[]
[]
[]
[null,null,{"$f":"IF($AE$5=0,\"\",IF(VLOOKUP($AE$5,領収証印刷データ!$A$11:$AF$1010,16,FALSE)=\"\",\"\",VLOOKUP($AE$5,領収証印刷データ!$A$11:$AF$1010,16,FALSE)))","v":""},null,null,{"$f":"IF($AE$5=0,\"\",IF(VLOOKUP($AE$5,領収証印刷データ!$A$11:$AF$1010,17,FALSE)=\"\",\"\",VLOOKUP($AE$5,領収証印刷データ!$A$11:$AF$1010,17,FALSE)))","v":""},{"$nulls":10},{"$f":"IF($AE$5=0,\"\",IF(VLOOKUP($AE$5,領収証印刷データ!$A$11:$AF$1010,9,FALSE)=\"\",\"\",VLOOKUP($AE$5,領収証印刷データ!$A$11:$AF$1010,9,FALSE)))","v":""},{"$nulls":4},"上記正に領収いたしました"]
[]
{"$rows_left_out":22}
{"sheet":"領収証印刷シート1面","index":6,"n_rows":100,"n_cols":36,"rows_kept":100,"merged":[[3,15,7,20],[4,2,4,10],[4,24,6,24],[4,25,6,26],[6,2,8,3],[6,4,8,10],[9,17,12,23],[9,24,12,24],[11,2,12,3],[11,4,12,10],[15,2,17,4],[15,5,17,10],[16,18,25,23],[20,2,21,4],[20,5,21,10],[24,2,26,4],[24,5,26,10],[29,2,31,5],[29,6,31,10],[29,16,31,16],[29,17,31,25],[34,2,35,4],[34,5,35,10],[34,17,35,25],[38,2,39,4],[38,5,39,10],[38,16,39,20],[38,21,39,25],[42,2,43,10],[42,15,43,16],[42,17,43,19],[43,21,46,24],[46,2,46,4],[46,15,48,16],[46,17,48,19],[47,21,51,24],[49,2,54,10],[51,15,52,17],[51,18,52,19],[52,21,56,24],[55,15,57,16],[55,17,57,19],[57,2,62,10],[57,21,61,24],[60,15,62,16],[60,17,62,19],[70,0,70,14],[71,16,73,19],[71,34,71,35],[72,1,72,14],[73,0,88,0],[73,1,73,14],[74,1,74,14],[75,1,77,14],[75,16,77,19],[78,1,80,14],[79,16,81,19],[81,1,82,14],[83,1,84,14],[83,16,85,19],[85,1,86,14],[87,1,87,14],[87,16,89,19],[88,1,88,14],[89,1,89,14],[90,0,100,0],[90,1,91,14],[92,1,92,14],[93,1,94,14],[95,1,95,14],[96,1,96,14],[97,1,97,14],[98,1,98,14],[99,1,100,14]]}
[]
[null,null,"領収証印刷シート1面"]
[]
[{"$nulls":15},"領 収 証　"]
[null,null,"領収証（控）",{"$nulls":21},"№",{"$f":"IF(領収証シート1面!Z5=\"\",\"\",領収証シート1面!Z5)","v":""}]
[]
[null,null,"№",null,{"$f":"IF(領収証シート1面!E7=\"\",\"\",領収証シート1面!E7)","v":""}]
[]
[]
[{"$nulls":17},{"$f":"IF(領収証シート1面!R10=\"宛先名を空白で印刷する\",\"\",IF(領収証シート1面!R10=\"\",\"\",領収証シート1面!R10))","v":""},{"$nulls":6},"様"]
[]
[null,null,"氏名",null,{"$f":"IF(領収証シート1面!E12=\"宛先名を空白で印刷する\",\"\",IF(領収証シート1面!E12=\"\",\"\",領収証シート1面!E12))","v":""}]
[]
[]
[]
[null,null,"請求金額",null,null,{"$f":"IF(領収証シート1面!F16=\"\",\"\",領収証シート1面!F16)","v":""}]
[{"$nulls":18},{"$f":"IF(領収証シート1面!S17=\"\",\"\",領収証シート1面!S17)","v":""}]
[]
[]
[]
[null,null,"領収金額",null,null,{"$f":"IF(領収証シート1面!F21=\"\",\"\",領収証シート1面!F21)","v":""}]
[]
[]
[]
[null,null,{"$f":"IF(領収証シート1面!C25=\"\",\"\",領収証シート1面!C25)","v":""},null,null,{"$f":"IF(領収証シート1面!F25=\"\",\"\",領収証シート1面!F25)","v":""}]
[]
[]
[]
[]
[null,null,{"$f":"IF(領収証シート1面!C30=\"\",\"\",領収証シート1面!C30)","v":""},{"$nulls":3},{"$f":"IF(領収証シート1面!G30=\"\",\"\",領収証シート1面!G30)","v":""},{"$nulls":9},"但",{"$f":"IF(領収証シート1面!R30=\"\",\"\",領収証シート1面!R30)","v":""}]
[]
[]
[]
[]
[null,null,{"$f":"IF(領収証シート1面!C35=\"\",\"\",領収証シート1面!C35)","v":""},null,null,{"$f":"IF(領収証シート1面!F35=\"\",\"\",領収証シート1面!F35)","v":""},{"$nulls":11},{"$f":"IF(領収証シート1面!R35=\"\",\"\",領収証シート1面!R35)","v":""}]
[]
[]
[]
[null,null,{"$f":"IF(領収証シート1面!C39=\"\",\"\",領収証シート1面!C39)","v":""},null,null,{"$f":"IF(領収証シート1面!F39=\"\",\"\",領収証シート1面!F39)","v":""},{"$nulls":10},{"$f":"IF(領収証シート1面!Q39=\"\",\"\",領収証シート1面!Q39)","v":""},{"$nulls":4},"上記正に領収いたしました"]
[]
{"$rows_left_out":53}
{"sheet":"領収証シート3面","index":7,"n_rows":183,"n_cols":32,"rows_kept":183,"merged":[[1,31,1,34],[4,2,4,10],[4,15,7,20],[4,24,6,24],[4,25,6,26],[4,30,6,30],[4,31,6,34],[6,2,8,3],[6,4,8,10],[9,17,12,23],[9,24,12,24],[11,2,12,3],[11,4,12,10],[15,2,17,4],[15,5,17,10],[16,18,25,23],[20,2,21,4],[20,5,21,10],[24,2,26,4],[24,5,26,10],[29,2,31,5],[29,6,31,10],[29,16,31,16],[29,17,31,25],[34,2,35,4],[34,5,35,10],[34,17,35,25],[38,2,39,4],[38,5,39,10],[38,16,39,20],[38,21,39,25],[42,2,43,10],[42,15,43,16],[42,17,43,19],[43,21,46,24],[46,2,46,4],[46,15,48,16],[46,17,48,19],[47,21,51,24],[49,2,54,10],[51,15,52,17],[51,18,52,19],[52,21,56,24],[55,15,57,16],[55,17,57,19],[57,2,62,10],[57,21,61,24],[60,15,62,16],[60,17,62,19],[65,2,65,10],[65,15,68,20],[65,24,67,24],[65,25,67,26],[65,30,67,30],[67,2,69,3],[67,4,69,10],[70,17,73,23],[70,24,73,24],[72,2,73,3],[72,4,73,10],[76,2,78,4],[76,5,78,10],[77,18,86,23],[81,2,82,4],[81,5,82,10],[85,2,87,4],[85,5,87,10],[90,2,92,5],[90,6,92,10],[90,16,92,16],[90,17,92,25],[95,2,96,4],[95,5,96,10],[95,17,96,25],[99,2,100,4],[99,5,100,10],[99,16,100,20],[99,21,100,25],[103,2,104,10],[103,15,104,16],[103,17,104,19],[104,21,107,24],[107,2,107,4],[107,15,109,16],[107,17,109,19],[108,21,112,24],[110,2,115,10],[112,15,113,17],[112,18,113,19],[113,21,117,24],[116,15,118,16],[116,17,118,19],[118,2,123,10],[118,21,122,24],[121,15,123,16],[121,17,123,19],[126,2,126,10],[126,15,129,20],[126,24,128,24],[126,25,128,26],[126,30,128,30],[128,2,130,3],[128,4,130,10],[131,17,134,23],[131,24,134,24],[133,2,134,3],[133,4,134,10],[137,2,139,4],[137,5,139,10],[138,18,147,23],[142,2,143,4],[142,5,143,10],[146,2,148,4],[146,5,148,10],[151,2,153,5],[151,6,153,10],[151,16,153,16],[151,17,153,25],[156,2,157,4],[156,5,157,10],[156,17,157,25],[160,2,161,4],[160,5,161,10],[160,16,161,20],[160,21,161,25],[164,2,165,10],[164,15,165,16],[164,17,165,19],[165,21,168,24],[168,2,168,4],[168,15,170,16],[168,17,170,19],[169,21,173,24],[171,2,176,10],[173,15,174,17],[173,18,174,19],[174,21,178,24],[177,15,179,16],[177,17,179,19],[179,2,184,10],[179,21,183,24],[182,15,184,16],[182,17,184,19]]}
[]
[null,null,"領収証シート3面",{"$nulls":15},"↓　スクロールバー",{"$nulls":11},{"$f":"COUNTA(領収証印刷データ!B11:B1010)","v":0},"印刷データ　カウント"]
[]
[]
[null,null,"領収証（控）",{"$nulls":12},"領 収 証",{"$nulls":8},"№",{"$f":"IF($AE$5=0,\"\",IF(VLOOKUP($AE$5,領収証印刷データ!$A$11:$AF$1010,2,FALSE)=\"\",\"\",VLOOKUP($AE$5,領収証印刷データ!$A$11:$AF$1010,2,FALSE)))","v":""},{"$nulls":4},4,"行番号"]
[]
[null,null,"№",null,{"$f":"IF($AE$5=0,\"\",IF(VLOOKUP($AE$5,領収証印刷データ!$A$11:$AF$1010,2,FALSE)=\"\",\"\",VLOOKUP($AE$5,領収証印刷データ!$A$11:$AF$1010,2,FALSE)))","v":""}]
[]
[]
[{"$nulls":17},{"$f":"IF($AE$5=0,\"\",IF(VLOOKUP($AE$5,領収証印刷データ!$A$11:$AF$1010,4,FALSE)=\"\",\"\",VLOOKUP($AE$5,領収証印刷データ!$A$11:$AF$1010,4,FALSE)))","v":""},{"$nulls":6},"様"]
[]
[null,null,"氏名",null,{"$f":"IF($AE$5=0,\"\",IF(VLOOKUP($AE$5,領収証印刷データ!$A$11:$AF$1010,4,FALSE)=\"\",\"\",VLOOKUP($AE$5,領収証印刷データ!$A$11:$AF$1010,4,FALSE)))","v":""}]
[]
[]
[]
[null,null,"請求金額",null,null,{"$f":"IF($AE$5=0,\"\",IF(VLOOKUP($AE$5,領収証印刷データ!$A$11:$AF$1010,5,FALSE)=\"\",\"\",VLOOKUP($AE$5,領収証印刷データ!$A$11:$AF$1010,5,FALSE)))","v":""}]
[{"$nulls":18},{"$f":"IF($AE$5=0,\"\",IF(VLOOKUP($AE$5,領収証印刷データ!$A$11:$AF$1010,6,FALSE)=\"\",\"\",VLOOKUP($AE$5,領収証印刷データ!$A$11:$AF$1010,6,FALSE)))","v":""}]
[]
[]
[]
[null,null,"領収金額",null,null,{"$f":"IF($AE$5=0,\"\",IF(VLOOKUP($AE$5,領収証印刷データ!$A$11:$AF$1010,6,FALSE)=\"\",\"\",VLOOKUP($AE$5,領収証印刷データ!$A$11:$AF$1010,6,FALSE)))","v":""}]
[]
[]
[]
[null,null,{"$f":"IF($AE$5=0,\"\",IF(VLOOKUP($AE$5,領収証印刷データ!$A$11:$AF$1010,10,FALSE)=\"\",\"\",VLOOKUP($AE$5,領収証印刷データ!$A$11:$AF$1010,10,FALSE)))","v":""},null,null,{"$f":"IF($AE$5=0,\"\",IF(VLOOKUP($AE$5,領収証印刷データ!$A$11:$AF$1010,11,FALSE)=\"\",\"\",VLOOKUP($AE$5,領収証印刷データ!$A$11:$AF$1010,11,FALSE)))","v":""}]
[]
[]
[]
[]
[null,null,{"$f":"IF($AE$5=0,\"\",IF(VLOOKUP($AE$5,領収証印刷データ!$A$11:$AF$1010,12,FALSE)=\"\",\"\",VLOOKUP($AE$5,領収証印刷データ!$A$11:$AF$1010,12,FALSE)))","v":""},{"$nulls":3},{"$f":"IF($AE$5=0,\"\",IF(VLOOKUP($AE$5,領収証印刷データ!$A$11:$AF$1010,13,FALSE)=\"\",\"\",VLOOKUP($AE$5,領収証印刷データ!$A$11:$AF$1010,13,FALSE)))","v":""},{"$nulls":9},"但",{"$f":"IF($AE$5=0,\"\",IF(VLOOKUP($AE$5,領収証印刷データ!$A$11:$AF$1010,7,FALSE)=\"\",\"\",VLOOKUP($AE$5,領収証印刷データ!$A$11:$AF$1010,7,FALSE)))","v":""}]
[]
[]
[]
[]
[null,null,{"$f":"IF($AE$5=0,\"\",IF(VLOOKUP($AE$5,領収証印刷データ!$A$11:$AF$1010,14,FALSE)=\"\",\"\",VLOOKUP($AE$5,領収証印刷データ!$A$11:$AF$1010,14,FALSE)))","v":""},null,null,{"$f":"IF($AE$5=0,\"\",IF(VLOOKUP($AE$5,領収証印刷データ!$A$11:$AF$1010,15,FALSE)=\"\",\"\",VLOOKUP($AE$5,領収証印刷データ!$A$11:$AF$1010,15,FALSE)))","v":""},{"$nulls":11},{"$f":"IF($AE$5=0,\"\",IF(VLOOKUP($AE$5,領収証印刷データ!$A$11:$AF$1010,8,FALSE)=\"\",\"\",VLOOKUP($AE$5,領収証印刷データ!$A$11:$AF$1010,8,FALSE)))","v":""}]
[]
[]
[]
[null,null,{"$f":"IF($AE$5=0,\"\",IF(VLOOKUP($AE$5,領収証印刷データ!$A$11:$AF$1010,16,FALSE)=\"\",\"\",VLOOKUP($AE$5,領収証印刷データ!$A$11:$AF$1010,16,FALSE)))","v":""},null,null,{"$f":"IF($AE$5=0,\"\",IF(VLOOKUP($AE$5,領収証印刷データ!$A$11:$AF$1010,17,FALSE)=\"\",\"\",VLOOKUP($AE$5,領収証印刷データ!$A$11:$AF$1010,17,FALSE)))","v":""},{"$nulls":10},{"$f":"IF($AE$5=0,\"\",IF(VLOOKUP($AE$5,領収証印刷データ!$A$11:$AF$1010,9,FALSE)=\"\",\"\",VLOOKUP($AE$5,領収証印刷データ!$A$11:$AF$1010,9,FALSE)))","v":""},{"$nulls":4},"上記正に領収いたしました"]
[]
{"$rows_left_out":144}
{"sheet":"領収証印刷シート3面","index":8,"n_rows":183,"n_cols":31,"rows_kept":183,"merged":[[4,2,4,10],[4,15,7,20],[4,24,6,24],[4,25,6,26],[6,2,8,3],[6,4,8,10],[9,17,12,23],[9,24,12,24],[11,2,12,3],[11,4,12,10],[15,2,17,4],[15,5,17,10],[16,18,25,23],[20,2,21,4],[20,5,21,10],[24,2,26,4],[24,5,26,10],[29,2,31,5],[29,6,31,10],[29,16,31,16],[29,17,31,25],[34,2,35,4],[34,5,35,10],[34,17,35,25],[38,2,39,4],[38,5,39,10],[38,16,39,20],[38,21,39,25],[42,2,43,10],[42,15,43,16],[42,17,43,19],[43,21,46,24],[46,2,46,4],[46,15,48,16],[46,17,48,19],[47,21,51,24],[49,2,54,10],[51,15,52,17],[51,18,52,19],[52,21,56,24],[55,15,57,16],[55,17,57,19],[57,2,62,10],[57,21,61,24],[60,15,62,16],[60,17,62,19],[65,2,65,10],[65,15,68,20],[65,24,67,24],[65,25,67,26],[67,2,69,3],[67,4,69,10],[70,17,73,23],[70,24,73,24],[72,2,73,3],[72,4,73,10],[76,2,78,4],[76,5,78,10],[77,18,86,23],[81,2,82,4],[81,5,82,10],[85,2,87,4],[85,5,87,10],[90,2,92,5],[90,6,92,10],[90,16,92,16],[90,17,92,25],[95,2,96,4],[95,5,96,10],[95,17,96,25],[99,2,100,4],[99,5,100,10],[99,16,100,20],[99,21,100,25],[103,2,104,10],[103,15,104,16],[103,17,104,19],[104,21,107,24],[107,2,107,4],[107,15,109,16],[107,17,109,19],[108,21,112,24],[110,2,115,10],[112,15,113,17],[112,18,113,19],[113,21,117,24],[116,15,118,16],[116,17,118,19],[118,2,123,10],[118,21,122,24],[121,15,123,16],[121,17,123,19],[126,2,126,10],[126,15,129,20],[126,24,128,24],[126,25,128,26],[128,2,130,3],[128,4,130,10],[131,17,134,23],[131,24,134,24],[133,2,134,3],[133,4,134,10],[137,2,139,4],[137,5,139,10],[138,18,147,23],[142,2,143,4],[142,5,143,10],[146,2,148,4],[146,5,148,10],[151,2,153,5],[151,6,153,10],[151,16,153,16],[151,17,153,25],[156,2,157,4],[156,5,157,10],[156,17,157,25],[160,2,161,4],[160,5,161,10],[160,16,161,20],[160,21,161,25],[164,2,165,10],[164,15,165,16],[164,17,165,19],[165,21,168,24],[168,2,168,4],[168,15,170,16],[168,17,170,19],[169,21,173,24],[171,2,176,10],[173,15,174,17],[173,18,174,19],[174,21,178,24],[177,15,179,16],[177,17,179,19],[179,2,184,10],[179,21,183,24],[182,15,184,16],[182,17,184,19]]}
[]
[null,null,"領収証印刷シート3面"]
[]
[]
[null,null,"領収証（控）",{"$nulls":21},"№",{"$f":"IF(領収証シート3面!Z5=\"\",\"\",領収証シート3面!Z5)","v":""}]
[]
[null,null,"№",null,{"$f":"IF(領収証シート3面!E7=\"\",\"\",領収証シート3面!E7)","v":""}]
[]
[]
[{"$nulls":17},{"$f":"IF(領収証シート3面!R10=\"宛先名を空白で印刷する\",\"\",IF(領収証シート3面!R10=\"\",\"\",領収証シート3面!R10))","v":""},{"$nulls":6},"様"]
[]
[null,null,"氏名",null,{"$f":"IF(領収証シート3面!E12=\"宛先名を空白で印刷する\",\"\",IF(領収証シート3面!E12=\"\",\"\",領収証シート3面!E12))","v":""}]
[]
[]
[]
[null,null,"請求金額",null,null,{"$f":"IF(領収証シート3面!F16=\"\",\"\",領収証シート3面!F16)","v":""}]
[{"$nulls":18},{"$f":"IF(領収証シート3面!S17=\"\",\"\",領収証シート3面!S17)","v":""}]
[]
[]
[]
[null,null,"領収金額",null,null,{"$f":"IF(領収証シート3面!F21=\"\",\"\",領収証シート3面!F21)","v":""}]
[]
[]
[]
[null,null,{"$f":"IF(領収証シート3面!C25=\"\",\"\",領収証シート3面!C25)","v":""},null,null,{"$f":"IF(領収証シート3面!F25=\"\",\"\",領収証シート3面!F25)","v":""}]
[]
[]
[]
[]
[null,null,{"$f":"IF(領収証シート3面!C30=\"\",\"\",領収証シート3面!C30)","v":""},{"$nulls":3},{"$f":"IF(領収証シート3面!G30=\"\",\"\",領収証シート3面!G30)","v":""},{"$nulls":9},"但",{"$f":"IF(領収証シート3面!R30=\"\",\"\",領収証シート3面!R30)","v":""}]
[]
[]
[]
[]
[null,null,{"$f":"IF(領収証シート3面!C35=\"\",\"\",領収証シート3面!C35)","v":""},null,null,{"$f":"IF(領収証シート3面!F35=\"\",\"\",領収証シート3面!F35)","v":""},{"$nulls":11},{"$f":"IF(領収証シート3面!R35=\"\",\"\",領収証シート3面!R35)","v":""}]
[]
[]
[]
[null,null,{"$f":"IF(領収証シート3面!C39=\"\",\"\",領収証シート3面!C39)","v":""},null,null,{"$f":"IF(領収証シート3面!F39=\"\",\"\",領収証シート3面!F39)","v":""},{"$nulls":10},{"$f":"IF(領収証シート3面!Q39=\"\",\"\",領収証シート3面!Q39)","v":""},{"$nulls":4},"上記正に領収いたしました"]
[]
{"$rows_left_out":144}
{"sheet":"読み取りシート","index":9,"n_rows":39,"n_cols":3,"rows_kept":39}
["簡単君ｒｋ2017-Ａ4は、ただいま、読み取り専用です"]
[]
[null,"通知がくるまでお待ちください"]
[]
[null,"（読み取りで開かれた場合、このシート（読み取りシート）が表示されます）"]
[null,"（簡単君ｒｋ2017-Ａ4をこのままにしておいて別の仕事をしてください）"]
[]
[]
[]
[]
[]
[]
[null,"≪ネットワーク環境で簡単君ｒｋ2017-Ａ4を使用する場合≫"]
[]
["①","簡単君ｒｋ2017-Ａ4を　Public　フォルダに置いて使用ください（下記Ａ・Ｂを参考にしてください）"]
[]
["②","②-1","Public　フォルダに置いてある、簡単君ｒｋ2017-Ａ4を開きます"]
[null,"②-2","（先に、他のユーザーが簡単君ｒｋ2017-Ａ4を開いている場合、下記の表示がされます）"]
[null,"②-3","使用中のファイル　で簡単君ｒｋ2017-Ａ4は、編集のためロックされています。"]
[null,"②-4","通知(N)をクリックします"]
[null,"②-5","読み取りシートが表示されます"]
[null,"②-6","使用中のファイルが閉じられると、下記の表示がされます"]
[null,"②-7","ファイル使用可能　で編集できるようになりました。"]
[null,"②-8","編集(W)をクリックします"]
[]
[]
[]
[]
[]
[]
["Ａ","Microsoft Office Ｅｘｃｅｌ ヘルプ (F1) で下記のキーワードで検索してください"]
[null,"パブリック フォルダーを使用したファイルの共有"]
[]
["Ｂ","パブリック フォルダーの場所"]
[null,"Windows のパブリック フォルダーは 1 つだけです。コンピューター上でユーザー アカウントを持つすべてのユーザーは、このフォルダーを共有します。"]
[null,"パブリック フォルダーを開くには :"]
[null,"①","[ドキュメント] を開くには、[スタート] ボタン　　 をクリックして、[ドキュメント] をクリックします。"]
[null,"②","ナビゲーション ウィンドウで、[お気に入りリンク] の [パブリック] をクリックします。[お気に入りリンク] に [パブリック] フォルダーが表示されないように"]
[null,null,"ナビゲーション ウィンドウを設定している場合は、[詳細]、[パブリック] の順にクリックします。"]

{"sheet":"回数","index":10,"n_rows":1,"n_cols":1,"rows_kept":1,"hidden":true}
[0]

{"sheet":"割り算の商と余り","index":11,"n_rows":7,"n_cols":4,"rows_kept":7,"hidden":true}
["分子","分母"]
["印刷データカウント","3面","商","余り"]
[{"$f":"COUNTA(領収証印刷データ!B11:B1010)","v":0},3,{"$f":"QUOTIENT(A3,B3)","v":0},{"$f":"MOD(A3,B3)","v":0}]
[]
["4頁以上の場合、商の部分リスト行数",{"$f":"B3*C3","v":0}]
[]
["4頁以上の場合、最終頁先頭行番号",{"$f":"(B3*C3)+1","v":1}]

{"sheet":"データリスト確認rk2017","index":12,"n_rows":10,"n_cols":32,"rows_kept":10,"hidden":true}
{"$rows_empty":9}
[null,"領収証ID","顧客名ID","顧客名","請求金額","領収金額","但書き（上段）","但書き（下段）","領収証発行日付","控項目名1","控項目名1内容","控項目名2","控項目名2内容","控項目名3","控項目名3内容","控項目名4","控項目名4内容","担当者ID","担当者","備考","メモ","領収証印刷日","領収証項目名1","領収証項目名1内容","領収証項目名2","領収証項目名2内容","領収証項目名3","領収証項目名3内容","領収証項目名4","領収証項目名4内容","領収証項目名5","領収証項目名5内容"]