{"text_format":"3","workbook":"xlsx","n_sheets":9,"sheets":["メニュー","領収証入力シート","領収証履歴データベース前","領収証履歴データベース","領収証印刷データ","領収証シート","領収証印刷シート","読み取りシート","回数"],"not_rendered":{"images":4,"macros":1,"defined_names":3,"comments":3},"read":"whole","date_system":"1900"}

{"sheet":"メニュー","index":0,"n_rows":99,"n_cols":13,"rows_kept":99,"merged":[[5,4,5,7],[5,9,5,11],[5,12,5,18],[7,5,7,7],[7,9,7,11],[7,12,7,18],[8,12,8,16],[10,5,10,7],[10,9,10,11],[10,12,10,18],[11,12,11,18],[13,5,13,7],[13,9,13,11],[13,12,13,18],[14,12,14,18],[16,5,16,7],[16,9,16,11],[16,12,16,18],[17,12,17,18],[19,5,19,7],[19,9,19,11],[19,12,19,18],[20,12,20,18],[22,5,22,7],[22,9,22,11],[22,12,22,18]]}
["領収証作成ソフト　簡単君　2015",{"$nulls":9},"企画/制作","高金印刷株式会社　（コウキンインサツカブシキガイシャ）"]
[{"$nulls":10},"住所","青森市千刈二丁目1番31号　〒038-0015"]
[{"$nulls":10},"TEL","017-781-2244"]
[{"$nulls":10},"FAX","017-781-2509"]
[]
[{"$nulls":4},"設定手順",{"$nulls":4},"確　認　　/　　入　力",null,null,"内　　　　容"]
[]
[{"$nulls":4},1,"消費税率設定確認",{"$nulls":3},{"v":0.08,"d":"8.00%"},null,null,"消費税の税率を入力します。セルJ8に半角数で数値を入力します（ 例：8.00% ）"]
[{"$nulls":12},"税率を変更する場合、セルＪ8に入力し、変更ボタンをクリックします"]
[]
[{"$nulls":4},2,"消費税円未満設定確認",{"$nulls":3},"切り捨てる",null,null,"課税対象額×税率＝円未満の処理方法の選択"]
[{"$nulls":12},"セルJ11をクリックし、現れた▼ボタンを押し、ドロップダウンリストから選択します"]
[]
[{"$nulls":4},3,"印刷パスワード入力",{"$nulls":6},"パスワードを入力していない場合、印刷実行ボタンは機能しません"]
[{"$nulls":12},"専用用紙（パスワード付）を弊社で販売しています"]
[]
[{"$nulls":4},4,"領収証の印刷設定",{"$nulls":6},"印刷設定は領収証印刷シートで設定します　自社名入力・レイアウト等設定できます"]
[{"$nulls":12},"印刷データは、このシートからプリンタに流れてゆきますので、用紙設定はこのシートでプリンタのプロパティーで設定します"]
[]
[{"$nulls":4},5,"ファイルを開くときの設定確認",{"$nulls":3},"メニュー",null,null,"領収証作成ソフト簡単君.xlsmを開くとき、はじめに表示するシートを選択できます"]
[{"$nulls":12},"セルJ20をクリックし、現れた▼ボタンを押し、ドロップダウンリストから選択します"]
[]
[{"$nulls":4},6,"領収証作成",{"$nulls":6},"領収証入力シートで必要事項を入力し領収証を印刷できます"]
{"$rows_empty":57}
[{"$nulls":9},"リスト"]
[{"$nulls":9},"切り捨てる"]
[{"$nulls":9},"切り上げる"]
[{"$nulls":9},"四捨五入"]
[]
[]
[]
[]
[{"$nulls":9},{"$f":"J8","v":{"v":0.08,"d":"8.00%"}}]
[{"$nulls":9},{"$f":"J89*100","v":8}]
[{"$nulls":9},{"$f":"100+J90","v":108}]
[]
[]
[]
[]
[{"$nulls":9},"リスト"]
[{"$nulls":9},"メニュー"]
[{"$nulls":9},"領収証入力シート"]
[{"$nulls":9},"領収証履歴データベース"]

{"sheet":"領収証入力シート","index":1,"n_rows":645,"n_cols":49,"rows_kept":645,"merged":[[0,38,0,39],[0,40,0,42],[0,43,0,45],[1,17,1,25],[1,27,1,33],[3,38,3,39],[4,2,4,10],[5,38,19,39],[6,2,7,3],[6,4,7,10],[6,15,9,19],[6,28,7,28],[6,29,7,30],[10,2,11,3],[10,4,11,10],[11,16,16,26],[11,27,16,28],[14,2,16,4],[14,5,16,10],[16,35,19,35],[19,2,21,4],[19,5,21,10],[21,16,28,28],[21,35,28,35],[23,2,24,10],[27,2,29,4],[27,5,29,10],[32,2,33,6],[32,7,33,10],[32,16,33,16],[32,17,33,28],[36,2,37,4],[36,5,37,10],[36,17,37,28],[40,2,41,4],[40,5,41,10],[40,15,41,16],[40,17,41,19],[40,20,41,24],[40,25,41,30],[44,2,45,4],[44,5,45,10],[44,15,45,16],[44,17,45,19],[48,2,48,4],[48,15,50,17],[48,18,50,19],[48,21,52,29],[50,2,58,10],[53,15,54,16],[53,17,54,19],[53,21,55,29],[56,21,59,29],[57,15,59,16],[57,17,59,19],[59,2,66,10],[60,21,63,29],[62,15,64,16],[62,17,64,19]]}
[{"$nulls":38},"漢数字を選択した場合の設定①",null,"チェックライター風を選択した場合",null,null,"アラビア数字+記号を選択した場合の設定"]
["領収証作成ソフト　簡単君　2015",{"$nulls":16},"↓　顧客名コンボボックス",{"$nulls":9},"↓　日付コンボボックス",{"$nulls":7},"選択（金額表示方法）",null,null,"金額頭文字","金額終わり文字","金額頭文字","カンマ","終止記号","金額頭文字","カンマ","金額終わり文字"]
[{"$nulls":35},"アラビア数字",null,null,"金","也","＠",",","＊","金",",","也"]
[{"$nulls":38},"漢数字を選択した場合の設定②"]
[null,null,"領収証(控)",{"$nulls":35},"表示する"]
[]
[null,null,"№",{"$nulls":12},"領　収　証",{"$nulls":12},"№"]
[]
[]
[]
[null,null,"氏　名",null,{"$f":"IF(Q12=\"\",\"\",Q12)","v":""}]
[{"$nulls":27},"様"]
[]
[]
[null,null,"請求金額"]
[]
[{"$nulls":35},"領収証金額入力"]
[]
[]
[null,null,"領収証金額",null,null,{"$f":"IF(AJ22=\"\",\"\",AJ22)","v":""}]
[]
[{"$nulls":16},{"$f":"IF(AJ22=\"\",\"\",IF(AJ3=\"チェックライター風\",AJ113,IF(AJ3=\"漢数字\",AJ111,IF(AJ3=\"アラビア数字+記号\",AJ118,AJ22))))","v":""}]
[]
[null,null,{"$f":"IF(U41=\"\",\"\",U41)","v":""}]
[]
[]
[]
[null,null,"税抜金額",null,null,{"$f":"IF(C28=\"\",\"\",IF(H33=\"\",\"\",IF(AJ22=\"\",\"\",AJ22-H33)))","v":""}]
[]
[]
[]
[]
[null,null,"消費税額等(8%)",{"$nulls":4},{"$f":"IF(OR(C33=AJ99,C33=AJ100,C33=AJ101,C33=AJ102,C33=AJ103,C33=AJ104,C33=AJ105,C33=\"\"),\"\",IF(Y112=0,\"\",IF(Y112=\"\",\"\",Y112)))","v":""},{"$nulls":8},"但"]
[]
[]
[]
[null,null,{"$f":"IF(P54=\"\",\"\",P54)","v":"現　金"},null,null,{"$f":"IF(R54=\"\",\"\",R54)","v":""}]
[]
[]
[]
[null,null,{"$f":"IF(P58=\"\",\"\",P58)","v":"小切手"},null,null,{"$f":"IF(R58=\"\",\"\",R58)","v":""},{"$nulls":9},"内訳",null,{"$f":"IF(F15=\"\",\"\",IF(P41=\"請求金額\",F15,\"\"))","v":""},{"$nulls":7},"上記正に領収いたしました"]
[]
[]
[]
[null,null,{"$f":"IF(P63=\"\",\"\",P63)","v":"手　形"},null,null,{"$f":"IF(R63=\"\",\"\",R63)","v":""},{"$nulls":9},"税抜金額",null,{"$f":"IF(P45=\"\",\"\",IF(S49=\"\",\"\",IF(AJ22=\"\",\"\",AJ22-S49)))","v":""}]
[]
[]
[]
[null,null,"摘　要",{"$nulls":12},"消費税額等(8%)",null,null,{"$f":"IF(OR(P49=AJ99,P49=AJ100,P49=AJ101,P49=AJ102,P49=AJ103,P49=AJ104,P49=AJ105,P49=\"\"),\"\",IF(Y112=0,\"\",IF(Y112=\"\",\"\",Y112)))","v":""},null,null,{"$f":"IF(領収証印刷シート!AJ74=\"\",\"\",領収証印刷シート!AJ74)","v":"高 金 印 刷 株 式 会 社　　"}]
[]
[null,null,{"$f":"IF(R33=\"\",\"\",R33)","v":""}]
[]
[]
[{"$nulls":15},"現　金",{"$nulls":5},{"$f":"IF(領収証印刷シート!AJ75=\"\",\"\",領収証印刷シート!AJ75)","v":"　　〒 038-0015"}]
[]
[]
[{"$nulls":21},{"$f":"IF(領収証印刷シート!AJ76=\"\",\"\",領収証印刷シート!AJ76)","v":"　　　　青森市千刈二丁目１番３１号"}]
[{"$nulls":15},"小切手"]
[]
[null,null,{"$f":"IF(R37=\"\",\"\",R37)","v":""}]
[{"$nulls":21},{"$f":"IF(領収証印刷シート!AJ77=\"\",\"\",領収証印刷シート!AJ77)","v":"　　　　　 電話　017-781-2244"}]
[]
[{"$nulls":15},"手　形"]
{"$rows_empty":7}
[{"$nulls":35},"リスト(セルP41用)",null,null,"金額頭文字リスト","金額終わり文字リスト",{"$nulls":3},"金額頭文字リスト",null,"金額終わり文字リスト"]
[{"$nulls":35},"内訳",null,null,"金","也",{"$nulls":3},"金",null,"也"]
[{"$nulls":35},"請求金額",null,null,"金、","円也",{"$nulls":3},"￥",null,"※"]
[{"$nulls":39},"円",{"$nulls":3},"\\",null,"-"]
[{"$nulls":45},"円也"]
[{"$nulls":45},"円"]
[{"$nulls":45},".-"]
[]
[]
[]
[]
[]
[{"$nulls":35},"リスト(セルC28とセルP45用)",null,null,"漢数字を選択した場合の設定②リスト"]
[{"$nulls":35},"税抜金額",null,null,"表示する"]
[{"$nulls":38},"表示しない"]
{"$rows_empty":9}
{"$rows_left_out":530}
{"sheet":"領収証履歴データベース前","index":2,"n_rows":11,"n_cols":35,"rows_kept":11,"hidden":true}
{"$rows_empty":9}
[null,"顧客名ID","顧客名","請求金額","領収証金額","但書き（上段）","但書き（下段）","領収証発行日付","控項目名1","控項目名1内容","控項目名2","控項目名2内容","控項目名3","控項目名3内容","控項目名4","控項目名4内容","控項目名5","控項目名5内容","担当者ID","担当者","備考","メモ","領収証印刷日","領収証項目名1","領収証項目名1内容","領収証項目名2","領収証項目名2内容","領収証項目名3","領収証項目名3内容","領収証項目名4","領収証項目名4内容","領収証項目名5","領収証項目名5内容","領収証項目名6","領収証項目名6内容"]
[null,null,{"$f":"IF(領収証入力シート!Q12=\"\",\"\",領収証入力シート!Q12)","v":""},{"$f":"IF(領収証入力シート!F15=\"\",\"\",領収証入力シート!F15)","v":""},{"$f":"IF(領収証入力シート!Q22=\"\",\"\",領収証入力シート!Q22)","v":""},{"$f":"IF(領収証入力シート!R33=\"\",\"\",領収証入力シート!R33)","v":""},{"$f":"IF(領収証入力シート!R37=\"\",\"\",領収証入力シート!R37)","v":""},{"$f":"IF(領収証入力シート!U41=\"\",\"\",領収証入力シート!U41)","v":""},{"$f":"IF(領収証入力シート!C28=\"\",\"\",領収証入力シート!C28)","v":"税抜金額"},{"$f":"IF(領収証入力シート!F28=\"\",\"\",領収証入力シート!F28)","v":""},{"$f":"IF(領収証入力シート!C33=\"\",\"\",領収証入力シート!C33)","v":"消費税額等(8%)"},{"$f":"IF(領収証入力シート!H33=\"\",\"\",領収証入力シート!H33)","v":""},{"$f":"IF(領収証入力シート!C37=\"\",\"\",領収証入力シート!C37)","v":"現　金"},{"$f":"IF(領収証入力シート!F37=\"\",\"\",領収証入力シート!F37)","v":""},{"$f":"IF(領収証入力シート!C41=\"\",\"\",領収証入力シート!C41)","v":"小切手"},{"$f":"IF(領収証入力シート!F41=\"\",\"\",領収証入力シート!F41)","v":""},{"$f":"IF(領収証入力シート!C45=\"\",\"\",領収証入力シート!C45)","v":"手　形"},{"$f":"IF(領収証入力シート!F45=\"\",\"\",領収証入力シート!F45)","v":""},{"$nulls":5},{"$f":"IF(領収証入力シート!P41=\"\",\"\",領収証入力シート!P41)","v":"内訳"},{"$f":"IF(領収証入力シート!R41=\"\",\"\",領収証入力シート!R41)","v":""},{"$f":"IF(領収証入力シート!P45=\"\",\"\",領収証入力シート!P45)","v":"税抜金額"},{"$f":"IF(領収証入力シート!R45=\"\",\"\",領収証入力シート!R45)","v":""},{"$f":"IF(領収証入力シート!P49=\"\",\"\",領収証入力シート!P49)","v":"消費税額等(8%)"},{"$f":"IF(領収証入力シート!S49=\"\",\"\",領収証入力シート!S49)","v":""},{"$f":"IF(領収証入力シート!P54=\"\",\"\",領収証入力シート!P54)","v":"現　金"},{"$f":"IF(領収証入力シート!R54=\"\",\"\",領収証入力シート!R54)","v":""},{"$f":"IF(領収証入力シート!P58=\"\",\"\",領収証入力シート!P58)","v":"小切手"},{"$f":"IF(領収証入力シート!R58=\"\",\"\",領収証入力シート!R58)","v":""},{"$f":"IF(領収証入力シート!P63=\"\",\"\",領収証入力シート!P63)","v":"手　形"},{"$f":"IF(領収証入力シート!R63=\"\",\"\",領収証入力シート!R63)","v":""}]

{"sheet":"領収証履歴データベース","index":3,"n_rows":10,"n_cols":35,"rows_kept":10,"merged":[[0,1,0,2],[1,1,1,2]]}
[null,"領収証データ転送先頭番号"]
[null,"領収証データ転送末尾番号"]
{"$rows_empty":7}
["領収証ID","顧客名ID","顧客名","請求金額","領収証金額","但書き（上段）","但書き（下段）","領収証発行日付","控項目名1","控項目名1内容","控項目名2","控項目名2内容","控項目名3","控項目名3内容","控項目名4","控項目名4内容","控項目名5","控項目名5内容","担当者ID","担当者","備考","メモ","領収証印刷日","領収証項目名1","領収証項目名1内容","領収証項目名2","領収証項目名2内容","領収証項目名3","領収証項目名3内容","領収証項目名4","領収証項目名4内容","領収証項目名5","領収証項目名5内容","領収証項目名6","領収証項目名6内容"]

{"sheet":"領収証印刷データ","index":4,"n_rows":1010,"n_cols":36,"rows_kept":1010}
["領収証印刷データ"]
{"$rows_empty":8}
["行番号","領収証ID","顧客名ID","顧客名","請求金額","領収証金額","但書き（上段）","但書き（下段）","領収証発行日付","控項目名1","控項目名1内容","控項目名2","控項目名2内容","控項目名3","控項目名3内容","控項目名4","控項目名4内容","控項目名5","控項目名5内容","担当者ID","担当者","備考","メモ","領収証印刷日","領収証項目名1","領収証項目名1内容","領収証項目名2","領収証項目名2内容","領収証項目名3","領収証項目名3内容","領収証項目名4","領収証項目名4内容","領収証項目名5","領収証項目名5内容","領収証項目名6","領収証項目名6内容"]
[1]
[2]
[3]
[4]
[5]
[6]
[7]
[8]
[9]
[10]
[11]
[12]
[13]
[14]
[15]
[16]
[17]
[18]
[19]
[20]
[21]
[22]
[23]
[24]
[25]
[26]
[27]
[28]
[29]
[30]
[31]
[32]
[33]
[34]
[35]
[36]
[37]
[38]
[39]
[40]
[41]
[42]
[43]
[44]
[45]
[46]
[47]
[48]
[49]
[50]
[51]
[52]
[53]
[54]
[55]
[56]
[57]
[58]
[59]
[60]
[61]
[62]
[63]
[64]
[65]
[66]
[67]
[68]
[69]
[70]
[71]
[72]
[73]
[74]
[75]
[76]
[77]
{"$rows_left_out":924}
{"sheet":"領収証シート","index":5,"n_rows":63,"n_cols":31,"rows_kept":63,"merged":[[1,2,1,4],[4,2,4,10],[6,2,7,3],[6,4,7,10],[6,15,9,19],[6,28,7,28],[6,29,7,30],[10,2,11,3],[10,4,11,10],[11,16,16,26],[11,27,16,28],[14,2,16,4],[14,5,16,10],[19,2,21,4],[19,5,21,10],[21,16,28,28],[23,2,24,10],[27,2,29,4],[27,5,29,10],[32,2,33,6],[32,7,33,10],[32,16,33,16],[32,17,33,28],[36,2,37,4],[36,5,37,10],[36,17,37,28],[40,2,41,4],[40,5,41,10],[40,15,41,16],[40,17,41,19],[40,20,41,24],[40,25,41,30],[44,2,45,4],[44,5,45,10],[44,15,45,16],[44,17,45,19],[48,2,48,4],[48,15,50,17],[48,18,50,19],[48,21,52,29],[50,2,58,10],[53,15,54,16],[53,17,54,19],[53,21,55,29],[56,21,59,29],[57,15,59,16],[57,17,59,19],[59,2,66,10],[60,21,63,29],[62,15,64,16],[62,17,64,19]]}
[]
[null,null,0,null,null,"行番号",{"$nulls":4},"↓　スクロールバー",{"$nulls":18},"印刷データ　カウント",{"$f":"COUNTA(領収証印刷データ!B11:B1010)","v":0}]
[]
[]
[null,null,"領収証(控)"]
[]
[null,null,"№",null,{"$f":"IF($C$2=0,\"\",IF(VLOOKUP($C$2,領収証印刷データ!$A$11:$AJ$1010,2,FALSE)=\"\",\"\",VLOOKUP($C$2,領収証印刷データ!$A$11:$AJ$1010,2,FALSE)))","v":""},{"$nulls":10},"領　収　証",{"$nulls":12},"№",{"$f":"IF($C$2=0,\"\",IF(VLOOKUP($C$2,領収証印刷データ!$A$11:$AJ$1010,2,FALSE)=\"\",\"\",VLOOKUP($C$2,領収証印刷データ!$A$11:$AJ$1010,2,FALSE)))","v":""}]
[]
[]
[]
[null,null,"氏　名",null,{"$f":"IF($C$2=0,\"\",IF(VLOOKUP($C$2,領収証印刷データ!$A$11:$AJ$1010,4,FALSE)=\"\",\"\",VLOOKUP($C$2,領収証印刷データ!$A$11:$AJ$1010,4,FALSE)))","v":""}]
[{"$nulls":16},{"$f":"IF($C$2=0,\"\",IF(VLOOKUP($C$2,領収証印刷データ!$A$11:$AJ$1010,4,FALSE)=\"\",\"\",VLOOKUP($C$2,領収証印刷データ!$A$11:$AJ$1010,4,FALSE)))","v":""},{"$nulls":10},"様"]
[]
[]
[null,null,"請求金額",null,null,{"$f":"IF($C$2=0,\"\",IF(VLOOKUP($C$2,領収証印刷データ!$A$11:$AJ$1010,5,FALSE)=\"\",\"\",VLOOKUP($C$2,領収証印刷データ!$A$11:$AJ$1010,5,FALSE)))","v":""}]
[]
[]
[]
[]
[null,null,"領収証金額",null,null,{"$f":"IF($C$2=0,\"\",IF(VLOOKUP($C$2,領収証印刷データ!$A$11:$AJ$1010,6,FALSE)=\"\",\"\",VLOOKUP($C$2,領収証印刷データ!$A$11:$AJ$1010,6,FALSE)))","v":""}]
[]
[{"$nulls":16},{"$f":"IF($C$2=0,\"\",IF(VLOOKUP($C$2,領収証印刷データ!$A$11:$AJ$1010,6,FALSE)=\"\",\"\",VLOOKUP($C$2,領収証印刷データ!$A$11:$AJ$1010,6,FALSE)))","v":""}]
[]
[null,null,{"$f":"IF($C$2=0,\"\",IF(VLOOKUP($C$2,領収証印刷データ!$A$11:$AJ$1010,9,FALSE)=\"\",\"\",VLOOKUP($C$2,領収証印刷データ!$A$11:$AJ$1010,9,FALSE)))","v":""}]
[]
[]
[]
[null,null,{"$f":"IF($C$2=0,\"\",IF(VLOOKUP($C$2,領収証印刷データ!$A$11:$AJ$1010,10,FALSE)=\"\",\"\",VLOOKUP($C$2,領収証印刷データ!$A$11:$AJ$1010,10,FALSE)))","v":""},null,null,{"$f":"IF($C$2=0,\"\",IF(VLOOKUP($C$2,領収証印刷データ!$A$11:$AJ$1010,11,FALSE)=\"\",\"\",VLOOKUP($C$2,領収証印刷データ!$A$11:$AJ$1010,11,FALSE)))","v":""}]
[]
[]
[]
[]
[null,null,{"$f":"IF($C$2=0,\"\",IF(VLOOKUP($C$2,領収証印刷データ!$A$11:$AJ$1010,12,FALSE)=\"\",\"\",VLOOKUP($C$2,領収証印刷データ!$A$11:$AJ$1010,12,FALSE)))","v":""},{"$nulls":4},{"$f":"IF($C$2=0,\"\",IF(VLOOKUP($C$2,領収証印刷データ!$A$11:$AJ$1010,13,FALSE)=\"\",\"\",VLOOKUP($C$2,領収証印刷データ!$A$11:$AJ$1010,13,FALSE)))","v":""},{"$nulls":8},"但",{"$f":"IF($C$2=0,\"\",IF(VLOOKUP($C$2,領収証印刷データ!$A$11:$AJ$1010,7,FALSE)=\"\",\"\",VLOOKUP($C$2,領収証印刷データ!$A$11:$AJ$1010,7,FALSE)))","v":""}]
[]
[]
[]
[null,null,{"$f":"IF($C$2=0,\"\",IF(VLOOKUP($C$2,領収証印刷データ!$A$11:$AJ$1010,14,FALSE)=\"\",\"\",VLOOKUP($C$2,領収証印刷データ!$A$11:$AJ$1010,14,FALSE)))","v":""},null,null,{"$f":"IF($C$2=0,\"\",IF(VLOOKUP($C$2,領収証印刷データ!$A$11:$AJ$1010,15,FALSE)=\"\",\"\",VLOOKUP($C$2,領収証印刷データ!$A$11:$AJ$1010,15,FALSE)))","v":""},{"$nulls":11},{"$f":"IF($C$2=0,\"\",IF(VLOOKUP($C$2,領収証印刷データ!$A$11:$AJ$1010,8,FALSE)=\"\",\"\",VLOOKUP($C$2,領収証印刷データ!$A$11:$AJ$1010,8,FALSE)))","v":""}]
[]
[]
[]
[null,null,{"$f":"IF($C$2=0,\"\",IF(VLOOKUP($C$2,領収証印刷データ!$A$11:$AJ$1010,16,FALSE)=\"\",\"\",VLOOKUP($C$2,領収証印刷データ!$A$11:$AJ$1010,16,FALSE)))","v":""},null,null,{"$f":"IF($C$2=0,\"\",IF(VLOOKUP($C$2,領収証印刷データ!$A$11:$AJ$1010,17,FALSE)=\"\",\"\",VLOOKUP($C$2,領収証印刷データ!$A$11:$AJ$1010,17,FALSE)))","v":""},{"$nulls":9},{"$f":"IF($C$2=0,\"\",IF(VLOOKUP($C$2,領収証印刷データ!$A$11:$AJ$1010,25,FALSE)=\"\",\"\",VLOOKUP($C$2,領収証印刷データ!$A$11:$AJ$1010,25,FALSE)))","v":""},null,{"$f":"IF($C$2=0,\"\",IF(VLOOKUP($C$2,領収証印刷データ!$A$11:$AJ$1010,26,FALSE)=\"\",\"\",VLOOKUP($C$2,領収証印刷データ!$A$11:$AJ$1010,26,FALSE)))","v":""},null,null,{"$f":"IF($C$2=0,\"\",IF(VLOOKUP($C$2,領収証印刷データ!$A$11:$AJ$1010,9,FALSE)=\"\",\"\",VLOOKUP($C$2,領収証印刷データ!$A$11:$AJ$1010,9,FALSE)))","v":""},{"$nulls":4},"上記正に領収いたしました"]
[]
[]
[]
[null,null,{"$f":"IF($C$2=0,\"\",IF(VLOOKUP($C$2,領収証印刷データ!$A$11:$AJ$1010,18,FALSE)=\"\",\"\",VLOOKUP($C$2,領収証印刷データ!$A$11:$AJ$1010,18,FALSE)))","v":""},null,null,{"$f":"IF($C$2=0,\"\",IF(VLOOKUP($C$2,領収証印刷データ!$A$11:$AJ$1010,19,FALSE)=\"\",\"\",VLOOKUP($C$2,領収証印刷データ!$A$11:$AJ$1010,19,FALSE)))","v":""},{"$nulls":9},{"$f":"IF($C$2=0,\"\",IF(VLOOKUP($C$2,領収証印刷データ!$A$11:$AJ$1010,27,FALSE)=\"\",\"\",VLOOKUP($C$2,領収証印刷データ!$A$11:$AJ$1010,27,FALSE)))","v":""},null,{"$f":"IF($C$2=0,\"\",IF(VLOOKUP($C$2,領収証印刷データ!$A$11:$AJ$1010,28,FALSE)=\"\",\"\",VLOOKUP($C$2,領収証印刷データ!$A$11:$AJ$1010,28,FALSE)))","v":""}]
[]
[]
[]
[null,null,"摘　要",{"$nulls":12},{"$f":"IF($C$2=0,\"\",IF(VLOOKUP($C$2,領収証印刷データ!$A$11:$AJ$1010,29,FALSE)=\"\",\"\",VLOOKUP($C$2,領収証印刷データ!$A$11:$AJ$1010,29,FALSE)))","v":""},null,null,{"$f":"IF($C$2=0,\"\",IF(VLOOKUP($C$2,領収証印刷データ!$A$11:$AJ$1010,30,FALSE)=\"\",\"\",VLOOKUP($C$2,領収証印刷データ!$A$11:$AJ$1010,30,FALSE)))","v":""},null,null,{"$f":"IF(領収証印刷シート!AJ74=\"\",\"\",領収証印刷シート!AJ74)","v":"高 金 印 刷 株 式 会 社　　"}]
[]
[null,null,{"$f":"IF($C$2=0,\"\",IF(VLOOKUP($C$2,領収証印刷データ!$A$11:$AJ$1010,7,FALSE)=\"\",\"\",VLOOKUP($C$2,領収証印刷データ!$A$11:$AJ$1010,7,FALSE)))","v":""}]
[]
[]
[{"$nulls":15},{"$f":"IF($C$2=0,\"\",IF(VLOOKUP($C$2,領収証印刷データ!$A$11:$AJ$1010,31,FALSE)=\"\",\"\",VLOOKUP($C$2,領収証印刷データ!$A$11:$AJ$1010,31,FALSE)))","v":""},null,{"$f":"IF($C$2=0,\"\",IF(VLOOKUP($C$2,領収証印刷データ!$A$11:$AJ$1010,32,FALSE)=\"\",\"\",VLOOKUP($C$2,領収証印刷データ!$A$11:$AJ$1010,32,FALSE)))","v":""},{"$nulls":3},{"$f":"IF(領収証印刷シート!AJ75=\"\",\"\",領収証印刷シート!AJ75)","v":"　　〒 038-0015"}]
[]
[]
[{"$nulls":21},{"$f":"IF(領収証印刷シート!AJ76=\"\",\"\",領収証印刷シート!AJ76)","v":"　　　　青森市千刈二丁目１番３１号"}]
[{"$nulls":15},{"$f":"IF($C$2=0,\"\",IF(VLOOKUP($C$2,領収証印刷データ!$A$11:$AJ$1010,33,FALSE)=\"\",\"\",VLOOKUP($C$2,領収証印刷データ!$A$11:$AJ$1010,33,FALSE)))","v":""},null,{"$f":"IF($C$2=0,\"\",IF(VLOOKUP($C$2,領収証印刷データ!$A$11:$AJ$1010,34,FALSE)=\"\",\"\",VLOOKUP($C$2,領収証印刷データ!$A$11:$AJ$1010,34,FALSE)))","v":""}]
[]
[null,null,{"$f":"IF($C$2=0,\"\",IF(VLOOKUP($C$2,領収証印刷データ!$A$11:$AJ$1010,8,FALSE)=\"\",\"\",VLOOKUP($C$2,領収証印刷データ!$A$11:$AJ$1010,8,FALSE)))","v":""}]
[{"$nulls":21},{"$f":"IF(領収証印刷シート!AJ77=\"\",\"\",領収証印刷シート!AJ77)","v":"　　　　　 電話　017-781-2244"}]
[]
[{"$nulls":15},{"$f":"IF($C$2=0,\"\",IF(VLOOKUP($C$2,領収証印刷データ!$A$11:$AJ$1010,35,FALSE)=\"\",\"\",VLOOKUP($C$2,領収証印刷データ!$A$11:$AJ$1010,35,FALSE)))","v":""},null,{"$f":"IF($C$2=0,\"\",IF(VLOOKUP($C$2,領収証印刷データ!$A$11:$AJ$1010,36,FALSE)=\"\",\"\",VLOOKUP($C$2,領収証印刷データ!$A$11:$AJ$1010,36,FALSE)))","v":""}]

{"sheet":"領収証印刷シート","index":6,"n_rows":101,"n_cols":36,"rows_kept":101,"merged":[[4,2,4,10],[6,2,7,3],[6,4,7,10],[6,15,9,19],[6,28,7,28],[6,29,7,30],[10,2,11,3],[10,4,11,10],[11,16,16,26],[11,27,16,28],[14,2,16,4],[14,5,16,10],[19,2,21,4],[19,5,21,10],[21,16,28,28],[23,2,24,10],[27,2,29,4],[27,5,29,10],[32,2,33,6],[32,7,33,10],[32,16,33,16],[32,17,33,28],[36,2,37,4],[36,5,37,10],[36,17,37,28],[40,2,41,4],[40,5,41,10],[40,15,41,16],[40,17,41,19],[40,20,41,24],[40,25,41,30],[44,2,45,4],[44,5,45,10],[44,15,45,16],[44,17,45,19],[48,2,48,4],[48,15,50,17],[48,18,50,19],[48,21,52,29],[50,2,58,10],[53,15,54,16],[53,17,54,19],[53,21,55,29],[56,21,59,29],[57,15,59,16],[57,17,59,19],[59,2,66,10],[60,21,63,29],[62,15,64,16],[62,17,64,19],[70,0,70,14],[71,16,73,19],[71,34,71,35],[72,1,72,14],[73,0,84,0],[73,1,73,14],[74,1,76,14],[75,16,77,19],[77,1,78,14],[79,1,80,14],[79,16,81,19],[80,34,80,35],[81,1,82,14],[81,34,81,35],[83,1,83,14],[83,16,85,19],[84,1,84,14],[85,0,88,0],[85,1,85,14],[86,1,87,14],[87,16,89,19],[88,1,88,14],[89,0,101,0],[89,1,89,14],[89,34,89,35],[90,1,91,14],[90,34,90,35],[91,34,91,35],[92,1,92,14],[92,34,92,35],[93,1,93,14],[93,34,93,35],[94,1,96,14],[97,1,97,14],[98,1,98,14],[99,1,99,14],[100,1,101,14]]}
[]
[]
[]
[]
[null,null,"領収証(控)"]
[]
[null,null,"№",null,{"$f":"IF(領収証シート!E7=\"\",\"\",領収証シート!E7)","v":""},{"$nulls":10},"領　収　証",{"$nulls":12},"№",{"$f":"IF(領収証シート!AD7=\"\",\"\",領収証シート!AD7)","v":""}]
[]
[]
[]
[null,null,"氏名",null,{"$f":"IF(領収証シート!E11=\"宛先名を空白で印刷する\",\"\",IF(領収証シート!E11=\"\",\"\",領収証シート!E11))","v":""}]
[{"$nulls":16},{"$f":"IF(領収証シート!Q12=\"宛先名を空白で印刷する\",\"\",IF(領収証シート!Q12=\"\",\"\",領収証シート!Q12))","v":""},{"$nulls":10},"様"]
[]
[]
[null,null,"請求金額",null,null,{"$f":"IF(領収証シート!F15=\"\",\"\",領収証シート!F15)","v":""}]
[]
[]
[]
[]
[null,null,"領収証金額",null,null,{"$f":"IF(領収証シート!F20=\"\",\"\",領収証シート!F20)","v":""}]
[]
[{"$nulls":16},{"$f":"IF(領収証シート!Q22=\"\",\"\",領収証シート!Q22)","v":""}]
[]
[null,null,{"$f":"IF(領収証シート!C24=\"\",\"\",領収証シート!C24)","v":""}]
[]
[]
[]
[null,null,{"$f":"IF(領収証シート!C28=\"\",\"\",領収証シート!C28)","v":""},null,null,{"$f":"IF(領収証シート!F28=\"\",\"\",領収証シート!F28)","v":""}]
[]
[]
[]
[]
[null,null,{"$f":"IF(領収証シート!C33=\"\",\"\",領収証シート!C33)","v":""},{"$nulls":4},{"$f":"IF(領収証シート!H33=\"\",\"\",領収証シート!H33)","v":""},{"$nulls":8},"但",{"$f":"IF(領収証シート!R33=\"\",\"\",領収証シート!R33)","v":""}]
[]
[]
[]
[null,null,{"$f":"IF(領収証シート!C37=\"\",\"\",領収証シート!C37)","v":""},null,null,{"$f":"IF(領収証シート!F37=\"\",\"\",領収証シート!F37)","v":""},{"$nulls":11},{"$f":"IF(領収証シート!R37=\"\",\"\",領収証シート!R37)","v":""}]
[]
[]
[]
[null,null,{"$f":"IF(領収証シート!C41=\"\",\"\",領収証シート!C41)","v":""},null,null,{"$f":"IF(領収証シート!F41=\"\",\"\",領収証シート!F41)","v":""},{"$nulls":9},{"$f":"IF(領収証シート!P41=\"\",\"\",領収証シート!P41)","v":""},null,{"$f":"IF(領収証シート!R41=\"\",\"\",領収証シート!R41)","v":""},null,null,{"$f":"IF(領収証シート!U41=\"\",\"\",領収証シート!U41)","v":""},{"$nulls":4},"正に領収いたしました"]
[]
[]
[]
[null,null,{"$f":"IF(領収証シート!C45=\"\",\"\",領収証シート!C45)","v":""},null,null,{"$f":"IF(領収証シート!F45=\"\",\"\",領収証シート!F45)","v":""},{"$nulls":9},{"$f":"IF(領収証シート!P45=\"\",\"\",領収証シート!P45)","v":""},null,{"$f":"IF(領収証シート!R45=\"\",\"\",領収証シート!R45)","v":""}]
[]
[]
[]
[null,null,"摘要",{"$nulls":12},{"$f":"IF(領収証シート!P49=\"\",\"\",領収証シート!P49)","v":""},null,null,{"$f":"IF(領収証シート!S49=\"\",\"\",領収証シート!S49)","v":""},null,null,{"$f":"IF(AJ74=\"\",\"\",AJ74)","v":"高 金 印 刷 株 式 会 社　　"}]
[]
[null,null,{"$f":"IF(領収証シート!C51=\"\",\"\",領収証シート!C51)","v":""}]
[]
[]
[{"$nulls":15},{"$f":"IF(領収証シート!P54=\"\",\"\",領収証シート!P54)","v":""},null,{"$f":"IF(領収証シート!R54=\"\",\"\",領収証シート!R54)","v":""},{"$nulls":3},{"$f":"IF(AJ75=\"\",\"\",AJ75)","v":"　　〒 038-0015"}]
[]
[]
[{"$nulls":21},{"$f":"IF(AJ76=\"\",\"\",AJ76)","v":"　　　　青森市千刈二丁目１番３１号"}]
[{"$nulls":15},{"$f":"IF(領収証シート!P58=\"\",\"\",領収証シート!P58)","v":""},null,{"$f":"IF(領収証シート!R58=\"\",\"\",領収証シート!R58)","v":""}]
[]
[null,null,{"$f":"IF(領収証シート!C60=\"\",\"\",領収証シート!C60)","v":""}]
[{"$nulls":21},{"$f":"IF(AJ77=\"\",\"\",AJ77)","v":"　　　　　 電話　017-781-2244"}]
[]
[{"$nulls":15},{"$f":"IF(領収証シート!P63=\"\",\"\",領収証シート!P63)","v":""},null,{"$f":"IF(領収証シート!R63=\"\",\"\",領収証シート!R63)","v":""}]
{"$rows_empty":7}
["領収証印刷シートでの設定方法"]
[{"$nulls":16},"テキストボックス　Ａ",{"$nulls":17},"設　定　１"]
["項目","内容",{"$nulls":33},"会 社 名 入 力 欄"]
["手順１","会社名の入力",{"$nulls":32},"１段目","高 金 印 刷 株 式 会 社　　"]
[null,"※　会社名データ表示方法は、セルまたは、テキストボックス表示どちらも自由に設定変更できます",{"$nulls":32},"２段目","　　〒 038-0015"]
[{"$nulls":16},"テキストボックス　Ｂ",{"$nulls":17},"３段目","　　　　青森市千刈二丁目１番３１号"]
[{"$nulls":34},"４段目","　　　　　 電話　017-781-2244"]
[null,"【設定の変更は『セルの書式設定(F)』で設定変更できます】"]
[]
[null,"※　ロゴ、マークなどイメージ画像を貼り付けることもできます",{"$nulls":14},"テキストボックス　Ｃ"]
[{"$nulls":34},"設　定　２"]
[null,"※　電子印鑑を使用する場合は、会社名等はテキストボックス表示になります",{"$nulls":32},"使用する用紙の種類での選択　（実行ボタンを押します）"]
[]
[null,"（テキストボックスを画面中央下側に設定しています）",{"$nulls":14},"テキストボックス　Ｄ"]
[null,"印刷範囲 ： セルB5からAG67に設定しています"]
["手順２","使用する用紙の種類での選択"]
{"$rows_left_out":16}
{"sheet":"読み取りシート","index":7,"n_rows":39,"n_cols":3,"rows_kept":39}
["領収証簡単君は、ただいま、読み取り専用です"]
[]
[null,"通知がくるまでお待ちください"]
[]
[null,"（読み取りで開かれた場合、このシート（読み取りシート）が開かれます）"]
[null,"（領収証簡単君をこのままにしておいて別の仕事をしてください）"]
[]
[]
[]
[]
[]
[]
[null,"≪ネットワーク環境で簡単君を使用する場合≫"]
[]
["①","領収証作成ソフト簡単君を　Public　フォルダに置いて使用ください（下記Ａ・Ｂを参考にしてください）"]
[]
["②","②-1","Public　フォルダに置いてある、領収証作成ソフト簡単君を開きます"]
[null,"②-2","（先に、他のユーザーが領収証作成ソフト簡単君を開いている場合、下記の表示がされます）"]
[null,"②-3","使用中のファイル　で領収証作成ソフト簡単君は、編集のためロックされています。"]
[null,"②-4","通知(N)をクリックします"]
[null,"②-5","読み取りシートが表示されます"]
[null,"②-6","使用中のファイルが閉じられると、下記の表示がされます"]
[null,"②-7","ファイル使用可能　で編集できるようになりました。"]
[null,"②-8","編集(W)をクリックします"]
[]
[]
[]
[]
[]
[]
["Ａ","Microsoft Office Ｅｘｃｅｌ ヘルプ (F1) で下記のキーワードで検索してください"]
[null,"パブリック フォルダーを使用したファイルの共有"]
[]
["Ｂ","パブリック フォルダーの場所"]
[null,"Windows のパブリック フォルダーは 1 つだけです。コンピューター上でユーザー アカウントを持つすべてのユーザーは、このフォルダーを共有します。"]
[null,"パブリック フォルダーを開くには :"]
[null,"①","[ドキュメント] を開くには、[スタート] ボタン　　 をクリックして、[ドキュメント] をクリックします。"]
[null,"②","ナビゲーション ウィンドウで、[お気に入りリンク] の [パブリック] をクリックします。[お気に入りリンク] に [パブリック] フォルダーが表示されないように"]
[null,null,"ナビゲーション ウィンドウを設定している場合は、[詳細]、[パブリック] の順にクリックします。"]

{"sheet":"回数","index":8,"n_rows":1,"n_cols":1,"rows_kept":1,"hidden":true}
[0]